{"text_format":"1","workbook":"xlsx","n_sheets":11,"sheets":["Introduction","Eligibility List","Materials List","P5.1","C5.3","C5.4, C5.5, C5.6","C5.7","C5.8","C5.9","C5.10","Summary"],"not_rendered":{"charts":0,"images":0,"macros":1,"external_links":0,"defined_names":4,"comments":1,"pivot_tables":0},"unopened":[],"bounds":{"document_bytes":16777216,"sheet_cells":100000,"rows_first":2000,"rows_last":500,"rows_between":2000,"halvings":0,"cell_chars":16384,"cell_head_chars":4096},"cells_cut":0,"cells_raw":0,"read":"whole","date_system":"1900"}

{"sheet":"Introduction","index":0,"n_rows":70,"n_cols":10,"rows_kept":70,"cut":false,"hidden":false,"merged":[[4,2,4,5],[20,2,20,5],[2,2,2,5],[7,4,7,5]]}
[]
[]
[null,null,"SITES® v2 Materials Worksheet"]
[]
[null,null,"MATERIALS INTRODUCTION"]
[]
[null,null,"PROJECT NAME",null,"PROJECT ID#"]
[]
[]
[null,null,"Step 1."]
{"$rows_left_out":61}
{"sheet":"Eligibility List","index":1,"n_rows":48,"n_cols":13,"rows_kept":48,"cut":false,"hidden":false,"merged":[[1,1,1,12],[3,1,3,12],[12,1,12,3],[9,1,9,3],[10,1,10,3],[11,1,11,3],[4,1,6,3],[4,4,5,12],[29,1,29,3],[30,1,30,3],[31,1,31,3],[22,1,22,3],[23,1,23,3],[24,1,24,3],[28,1,28,3],[21,1,21,3],[7,1,7,3],[8,1,8,3],[26,1,26,3],[27,1,27,3],[20,1,20,3],[19,1,19,3],[13,1,13,3],[18,1,18,3],[17,1,17,3],[16,1,16,3],[15,1,15,3],[14,1,14,3],[44,1,44,12],[45,1,45,12],[46,1,46,12],[47,1,47,12],[39,1,39,12],[40,1,40,12],[41,1,41,12],[42,1,42,12],[43,1,43,12],[35,1,35,3],[36,1,36,3],[32,1,32,3],[33,1,33,3],[34,1,34,3]]}
[]
[null,"SITES® v2 Materials Worksheet"]
[]
[null,"PRODUCT AND MATERIAL ELIGIBILITY"]
[null,"PRODUCT OR MATERIAL",null,null,"ELIGIBILITY - REQUIRED TO BE INCLUDED"]
[]
[null,null,null,null,"P5.1","C5.3","C5.4","C5.5","C5.6","C5.7","C5.8","C5.9","C5.10"]
[null,"Plant",null,null,null,null,"●",null,"250 mi",null,null,null,"●"]
[null,"Seed",null,null,null,null,null,null,"500 mi",null,null,null,"●"]
[null,"Sod",null,null,null,null,"●",null,"250 mi",null,null,null,"●"]
{"$rows_left_out":39}
{"sheet":"Materials List","index":2,"n_rows":70,"n_cols":8,"rows_kept":70,"cut":false,"hidden":false,"merged":[[7,1,7,2],[6,1,6,6],[1,1,1,7],[3,1,3,7]]}
[]
[null,"SITES® v2 Materials Worksheet"]
[]
[null,"PRODUCT AND MATERIAL IDENTIFICATION"]
[]
[null,"INSTRUCTIONS:"]
[null,"1. Complete the following form for all products and materials purchased for the project that are included in the prerequisite and credits (applicable) excluding labor."]
[]
[null,"Description of Material","Manufacturer or \nSupplier Name","Material/Product\nType","Salvaged or Reused","Cost per Unit","Quantity","Total Materials Cost"]
[{"$f":"IF(F10>=0,0,0)","v":0},null,null,null,null,null,1,{"$f":"F10*G10","v":0}]
{"$rows_left_out":61}
{"sheet":"P5.1","index":3,"n_rows":31,"n_cols":10,"rows_kept":31,"cut":false,"hidden":false,"merged":[[1,1,1,9],[7,9,8,9],[7,1,7,3],[7,4,8,4],[7,5,8,5],[7,6,8,6],[7,7,8,7],[7,8,8,8],[3,1,3,9]]}
[]
[null,"SITES® v2 Materials Worksheet"]
[]
[null,"P5.1: ELIMINATE THE USE OF WOOD FROM THREATENED TREE SPECIES"]
[]
[null,"INSTRUCTIONS:"]
[null,"1. This prerequisite does not apply to non-wood materials. All wood, manufactured wood, wood mulch or other wood products must meet this prerequisite."]
[null,"MATERIALS IDENTIFICATION\n(from Materials List tab)",null,null,"Product type is eligible for prerequisite","Wood Species","CITES Status","IUCN Status","Third-Party\nCertification?","Meets P5.1?"]
[null,"Description of Material","Manufacturer or \nSupplier Name","Material/Product\nType"]
[{"$f":"IF(B10>=0,0,0)","v":0},{"$f":"IF(ISBLANK('Materials List'!B10),\"\",'Materials List'!B10)","v":""},{"$f":"IF(ISBLANK('Materials List'!C10),\"\",'Materials List'!C10)","v":""},{"$f":"IF(ISBLANK('Materials List'!D10),\"\",'Materials List'!D10)","v":""},{"$f":"IF(D10=\"\",\"N\",IF(COUNTIF($B$29:$B$31,D10),\"Y\",\"N\"))","v":"N"},null,null,null,null,{"$f":"IF(E10=\"Y\",IF(OR(AND(OR(G10<>\"Other or not listed\",H10<>\"Other or not listed\"),I10=\"Y\"),AND(G10=\"Other or not listed\",H10=\"Other or not listed\")),\"Y\",\"N\"),\"N/A\")","v":"N/A"}]
{"$rows_left_out":22}
{"sheet":"C5.3","index":4,"n_rows":49,"n_cols":8,"rows_kept":49,"cut":false,"hidden":false,"merged":[[1,1,1,7],[3,1,3,7],[7,5,8,5],[7,1,7,4],[7,6,8,6],[7,7,8,7],[6,1,6,7]]}
[]
[null,"SITES® v2 Materials Worksheet"]
[]
[null,"C5.3: DESIGN FOR ADAPTABILITY AND DISASSEMBLY"]
[]
[null,"INSTRUCTIONS:"]
[null,"1. Enter the percentage of reusable weight. Percentages are based on cost or replacement value. In the case of mixed material assemblies, determine the portion of the total weight that is reusable."]
[null,"MATERIALS IDENTIFICATION\n(from Materials List tab)",null,null,null,"Product type is eligible for credit","Reusable Weight \n(%)","Total Cost of Reusable Components"]
[null,"Description of Material","Manufacturer or \nSupplier Name","Material/Product\nType","Total Cost of Material"]
[{"$f":"IF(B10>=0,0,0)","v":0},{"$f":"IF(ISBLANK('Materials List'!B10),\"\",'Materials List'!B10)","v":""},{"$f":"IF(ISBLANK('Materials List'!C10),\"\",'Materials List'!C10)","v":""},{"$f":"IF(ISBLANK('Materials List'!D10),\"\",'Materials List'!D10)","v":""},{"$f":"IF(ISBLANK('Materials List'!H10),\"\",'Materials List'!H10)","v":0},{"$f":"IF(D10=\"\",\"N\",IF(COUNTIF($B$29:$B$49,D10),\"Y\",\"N\"))","v":"N"},null,{"$f":"IF(F10=\"Y\",G10*E10,\"N/A\")","v":"N/A"}]
{"$rows_left_out":40}
{"sheet":"C5.4, C5.5, C5.6","index":5,"n_rows":39,"n_cols":20,"rows_kept":39,"cut":false,"hidden":false,"merged":[[27,15,27,19],[27,6,27,13],[23,6,23,7],[1,1,1,4],[24,6,24,7],[3,1,3,4],[7,15,7,19],[22,15,22,18],[23,15,23,18],[24,15,24,18],[6,1,6,4],[22,1,22,3],[24,10,24,12],[23,10,23,12],[7,6,7,8],[7,10,7,13],[7,1,7,4],[22,10,22,12],[22,6,22,7]]}
[]
[null,"SITES® v2 Materials Worksheet"]
[]
[null,"C5.4: REUSE SALVAGED MATERIALS AND PLANTS\nC5.5: USE RECYCLED CONTENT MATERIALS\nC5.6: USE REGIONAL MATERIALS\n"]
[]
[null,"INSTRUCTIONS:"]
[null,"1. Enter applicable information for each material under each credit. Percentages are based on cost or replacement value. "]
[null,"MATERIALS IDENTIFICATION\n(from Materials List tab)",null,null,null,null,"C5.4: SALVAGED MATERIALS",null,null,null,"C5.5: RECYCLED CONTENT",null,null,null,null,"C5.6: REGIONAL"]
[null,"Description of Material","Manufacturer or \nSupplier Name","Material/Product\nType","Total Cost of Material",null,"Product type is eligible for credit","Salvaged or\nReused\n(from Materials List tab)","Total Cost of Salvaged Material",null,"Product type is eligible for credit","Post-\nConsumer\n(%)","Pre-Consumer\n(%)","Total Cost of Recycled Materials",null,"Maximum \nAllowable\nDistance\n(miles)","Manufacturer Supplier Distance\n(miles)","Extraction Distance\n(miles)","Percent Weight Regional\n(%)","Total Cost of Regional\nMaterials"]
[{"$f":"IF(B10>=0,0,0)","v":0},{"$f":"IF(ISBLANK('Materials List'!B10),\"\",'Materials List'!B10)","v":""},{"$f":"IF(ISBLANK('Materials List'!C10),\"\",'Materials List'!C10)","v":""},{"$f":"IF(ISBLANK('Materials List'!D10),\"\",'Materials List'!D10)","v":""},{"$f":"IF(ISBLANK('Materials List'!H10),\"\",'Materials List'!H10)","v":0},null,{"$f":"IF($D10=\"\",\"N\",IF(COUNTIF($G$30:$G$34,$D10),\"N\",\"Y\"))","v":"N"},{"$f":"IF(ISBLANK('Materials List'!E10),\"\",'Materials List'!E10)","v":""},{"$f":"IF(G10=\"N\",\"N/A\",IF(H10=\"Y\",E10,0))","v":"N/A"},null,{"$f":"IF($D10=\"\",\"N\",IF(COUNTIF($K$30:$K$38,$D10),\"N\",\"Y\"))","v":"N"},null,null,{"$f":"IF(K10=\"N\",\"N/A\",IF(OR(L10>0,M10>0),$E10*(L10+(0.5*M10)),0))","v":"N/A"},null,{"$f":"IF(D10=\"\",\"\",IF(COUNTIF($P$30:$P$39,$D10),50,IF(OR(D10=\"Plant\",D10=\"Sod\"),250,500)))","v":""},null,null,null,{"$f":"IF(AND(Q10<P10,R10<P10,S10>0),E10*S10,0)","v":0}]
{"$rows_left_out":30}
{"sheet":"C5.7","index":6,"n_rows":32,"n_cols":15,"rows_kept":32,"cut":false,"hidden":false,"merged":[[27,5,27,11],[6,1,6,11],[7,12,8,12],[22,1,22,4],[7,1,7,3],[7,4,7,7],[7,8,8,8],[7,9,8,9],[7,10,8,10],[7,11,8,11],[25,8,25,13],[26,8,26,13],[22,13,22,14],[23,8,23,12],[24,8,24,13],[1,1,1,14],[3,1,3,14],[7,13,8,13],[7,14,8,14],[22,8,22,11]]}
[]
[null,"SITES® v2 Materials Worksheet"]
[]
[null,"C5.7: SUPPORT RESPONSIBLE EXTRACTION OF RAW MATERIALS"]
[]
[null,"INSTRUCTIONS:"]
[null,"1. Only the product types listed in the Reference Guide are eligible for this credit. If any materials supplier provides publically available information meeting the requirements of this credit no letter needs to be submitted, but the project should still choose \"Y\" in the \"Supporting Documentation\" and \"Option 1 Letter Sent\" Columns under this credit."]
[null,"MATERIALS IDENTIFICATION\n(from Materials List tab)",null,null,"Product Eligibility",null,null,null,"Total Cost of Material","Option","Supporting Documentation","Option 2 and Option 3 only:\nPercent Weight Responsibly Extracted\n(%)","Option 1 Letter Sent (Y or N)","Total Cost of Option 2\nMaterials","Total Cost of Option 3\nMaterials"]
[null,"Description of Material","Manufacturer or \nSupplier Name","Material/Product\nType","Salvaged or Reused","Recycled","Product and Material Eligibility for C5.7","Final Eligibility"]
[{"$f":"IF(B10>=0,0,0)","v":0},{"$f":"IF(ISBLANK('Materials List'!B10),\"\",'Materials List'!B10)","v":""},{"$f":"IF(ISBLANK('Materials List'!C10),\"\",'Materials List'!C10)","v":""},{"$f":"IF(ISBLANK('Materials List'!D10),\"\",'Materials List'!D10)","v":""},{"$f":"IF(ISBLANK('Materials List'!E10),\"\",'Materials List'!E10)","v":""},{"$f":"IF(VLOOKUP(D10,'C5.4, C5.5, C5.6'!D:M,9,FALSE)+VLOOKUP(D10,'C5.4, C5.5, C5.6'!D:M,10,FALSE)<>0,\"Y\",\"N\")","v":"N"},{"$f":"IF($D10=\"\",\"N\",IF(COUNTIF($F$30:$F$36,$D10),\"N\",\"Y\"))","v":"N"},{"$f":"IF(AND(E10=\"N\",F10=\"N\",G10=\"Y\"),\"Y\",\"N\")","v":"N"},{"$f":"IF(ISBLANK('Materials List'!H10),\"\",'Materials List'!H10)","v":0},null,null,null,null,{"$f":"IF(H10=\"N\",\"N/A\",IF(AND(J10=\"Opt 2\",H10=\"Y\",L10>0,K10=\"Y\"),$I10*L10,0))","v":"N/A"},{"$f":"IF(H10=\"N\",\"N/A\",IF(AND(J10=\"Opt 3\",H10=\"Y\",L10>0,K10=\"Y\"),$I10*L10,0))","v":"N/A"}]
{"$rows_left_out":23}
{"sheet":"C5.8","index":7,"n_rows":41,"n_cols":12,"rows_kept":41,"cut":false,"hidden":false,"merged":[[1,1,1,11],[3,1,3,11],[25,1,25,10],[26,1,26,10],[6,1,6,11],[7,11,8,11],[22,1,22,8],[23,1,23,6],[24,1,24,10],[7,1,7,5],[7,6,8,6],[7,9,8,9],[7,10,8,10],[7,7,8,7],[7,8,8,8]]}
[]
[null,"SITES® v2 Materials Worksheet"]
[]
[null,"C5.8: SUPPORT TRANSPARENCY AND SAFER CHEMISTRY"]
[]
[null,"INSTRUCTIONS:"]
[null,"1. Only the product types listed in the Reference Guide are eligible for this credit. If any materials supplier provides publically available information meeting the requirements of this credit no letter needs to be submitted, but the project should still choose \"Y\" in the \"Supporting Documentation\" and \"Option 1 Letter Sent\" Columns under this credit."]
[null,"MATERIALS IDENTIFICATION\n(from Materials List tab)",null,null,null,null,"Product type is eligible for credit","Option","Supporting Documentation","Option 1 Letter Sent (Y or N)","Total Cost of Option 2\nMaterials","Total Cost of Option 3\nMaterials"]
[null,"Description of Material","Manufacturer or \nSupplier Name","Material/Product\nType","Salvaged or Reused","Total Cost of Material"]
[{"$f":"IF(B10>=0,0,0)","v":0},{"$f":"IF(ISBLANK('Materials List'!B10),\"\",'Materials List'!B10)","v":""},{"$f":"IF(ISBLANK('Materials List'!C10),\"\",'Materials List'!C10)","v":""},{"$f":"IF(ISBLANK('Materials List'!D10),\"\",'Materials List'!D10)","v":""},{"$f":"IF(ISBLANK('Materials List'!E10),\"\",'Materials List'!E10)","v":""},{"$f":"IF(ISBLANK('Materials List'!H10),\"\",'Materials List'!H10)","v":0},{"$f":"IF(D10=\"\",\"N\",IF(COUNTIF($B$31:$B$41,D10),\"Y\",\"N\"))","v":"N"},null,null,null,{"$f":"IF(G10=\"N\",\"N/A\",IF(AND(H10=\"Opt 2\",I10=\"Y\",E10=\"N\"),$F10,0))","v":"N/A"},{"$f":"IF(OR(G10=\"N\",H10<>\"Opt 3\"),\"N/A\",IF(AND(H10=\"Opt 3\",I10=\"Y\",E10=\"N\"),$F10,0))","v":"N/A"}]
{"$rows_left_out":32}
{"sheet":"C5.9","index":8,"n_rows":50,"n_cols":12,"rows_kept":50,"cut":false,"hidden":false,"merged":[[1,1,1,11],[3,1,3,11],[24,1,24,10],[25,1,25,10],[26,1,26,10],[7,9,8,9],[7,10,8,10],[6,1,6,11],[7,11,8,11],[23,1,23,6],[7,1,7,5],[7,7,8,7],[7,8,8,8],[7,6,8,6],[22,1,22,8]]}
[]
[null,"SITES® v2 Materials Worksheet"]
[]
[null,"C5.9: SUPPORT SUSTAINABILITY IN MATERIALS MANUFACTURING"]
[]
[null,"INSTRUCTIONS:"]
[null,"1. Natural rocks or boulders; plants, sod, and seed; soils; and salvaged materials are excluded from this credit. If any manufacturer provides publically available information meeting the requirements of this credit no letter needs to be submitted, but the project should still choose \"Y\" in the \"Supporting Documentation\" and \"Option 1 Letter Sent\" Columns under this credit."]
[null,"MATERIALS IDENTIFICATION\n(from Materials List tab)",null,null,null,null,"Product type is eligible for credit","Option","Supporting Documentation","Option 1 Letter Sent (Y or N)","Total Cost of Option 2\nMaterials","Total Cost of Option 3\nMaterials"]
[null,"Description of Material","Manufacturer or \nSupplier Name","Material/Product\nType","Salvaged or Reused","Total Cost of Material"]
[{"$f":"IF(B10>=0,0,0)","v":0},{"$f":"IF(ISBLANK('Materials List'!B10),\"\",'Materials List'!B10)","v":""},{"$f":"IF(ISBLANK('Materials List'!C10),\"\",'Materials List'!C10)","v":""},{"$f":"IF(ISBLANK('Materials List'!D10),\"\",'Materials List'!D10)","v":""},{"$f":"IF(ISBLANK('Materials List'!E10),\"\",'Materials List'!E10)","v":""},{"$f":"IF(ISBLANK('Materials List'!H10),\"\",'Materials List'!H10)","v":0},{"$f":"IF(D10=\"\",\"N\",IF(COUNTIF($B$31:$B$50,D10),\"Y\",\"N\"))","v":"N"},null,null,null,{"$f":"IF(G10=\"N\",\"N/A\",IF(AND(H10=\"Opt 2\",I10=\"Y\",E10=\"N\"),$F10,0))","v":"N/A"},{"$f":"IF(G10=\"N\",\"N/A\",IF(AND(H10=\"Opt 3\",I10=\"Y\",E10=\"N\"),$F10,0))","v":"N/A"}]
{"$rows_left_out":41}
{"sheet":"C5.10","index":9,"n_rows":33,"n_cols":11,"rows_kept":33,"cut":false,"hidden":false,"merged":[[1,1,1,10],[3,1,3,10],[26,1,26,9],[22,1,22,7],[23,1,23,8],[7,10,8,10],[7,7,8,7],[7,6,8,6],[7,8,8,8],[7,9,8,9],[6,1,6,10],[7,5,8,5],[7,1,7,4],[24,1,24,9],[25,1,25,9]]}
[]
[null,"SITES® v2 Materials Worksheet"]
[]
[null,"C5.10: SUPPORT SUSTAINABILITY IN PLANT PRODUCTION"]
[]
[null,"INSTRUCTIONS:"]
[null,"1. Only plants, sod, and seed are included in this credit. If any materials supplier provides publically available information meeting the requirements of this credit no letter needs to be submitted, but the project should still choose \"Y\" in the \"Supporting Documentation\" and \"Option 1 Letter Sent\" Columns under this credit."]
[null,"MATERIALS IDENTIFICATION\n(from Materials List tab)",null,null,null,"Product type is eligible for credit","Option","Supporting Documentation","Option 1 Letter Sent (Y or N)","Total Cost of \nOption 2\nMaterials","Total Cost of \nOption 3\nMaterials"]
[null,"Description of Material","Manufacturer or \nSupplier Name","Material/Product\nType","Total Cost of Material"]
[{"$f":"IF(B10>=0,0,0)","v":0},{"$f":"IF(ISBLANK('Materials List'!B10),\"\",'Materials List'!B10)","v":""},{"$f":"IF(ISBLANK('Materials List'!C10),\"\",'Materials List'!C10)","v":""},{"$f":"IF(ISBLANK('Materials List'!D10),\"\",'Materials List'!D10)","v":""},{"$f":"IF(ISBLANK('Materials List'!H10),\"\",'Materials List'!H10)","v":0},{"$f":"IF(D10=\"\",\"N\",IF(COUNTIF($B$31:$B$33,D10),\"Y\",\"N\"))","v":"N"},null,null,null,{"$f":"IF(F10=\"N\",\"N/A\",IF(AND(G10=\"Opt 2\",H10=\"Y\"),$E10,0))","v":"N/A"},{"$f":"IF(F10=\"N\",\"N/A\",IF(AND(G10=\"Opt 3\",H10=\"Y\"),$E10,0))","v":"N/A"}]
{"$rows_left_out":24}
{"sheet":"Summary","index":10,"n_rows":146,"n_cols":8,"rows_kept":146,"cut":false,"hidden":false,"merged":[[121,2,121,7],[145,2,145,7],[19,2,19,7],[29,2,29,7],[39,2,39,7],[49,2,49,7],[73,2,73,7],[97,2,97,7]]}
[]
[]
[null,null,"SUMMARY"]
[null,null,"Note: All information on this tab is READ-ONLY. To edit, see previous tabs."]
[]
[]
[null,null,"P5.1:ELIMINATE THE USE OF WOOD FROM THREATENED TREE SPECIES"]
[]
[null,null,"All products meet prerequisite?",null,null,null,null,{"$f":"P5.1!J23","v":"N/A"}]
[]
{"$rows_left_out":136}